KEY,DESC TEXT,DESC LAYER,SYMBOL,SYM SCALE,SYM LAYER,SYM TRIM,MOVE DESC,MOVE NUM,MOVE ELEV,MOVE NODE,CONNECT,LINE LAYER,LINE TYPE,COLOR,2D,LINES,PLINE WIDTH,LEGAL DESC,SYM SCALE TOG,MARKER TYPE,MARKER SIZE,MARKER COLOR,EXCLUDE FROM DTM,POINT NUMBER LAYER,ELEVATION LAYER,NODE LAYER,DESC LAYER COLOR,NUMBER LAYER COLOR,ELEV LAYER COLOR,NODE LAYER COLOR,SCALE LAST,ROTATE LAST,ROTATE RANDOM,NO SYM ROTATION,PLOT EXACT DESC
BPROFJ,1060,DESCRIPTION,c:\Program Files\MicroSurvey\STN013411\b01060.dwg,0,znacky_ostatne,0,0,0,0,0,0,,,7,1,0,0,BPROFJ,0,2,0.5,0,0,,,,7,7,7,7,0,0,0,0,0
BPOMER,1070,DESCRIPTION,c:\Program Files\MicroSurvey\STN013411\b01070.dwg,0,znacky_ostatne,0,0,0,0,0,0,,,7,1,0,0,BPOMER,0,2,0.5,0,0,,,,7,7,7,7,0,0,0,0,0
BRURKA,1080,DESCRIPTION,c:\Program Files\MicroSurvey\STN013411\b01080.dwg,0,znacky_ostatne,0,0,0,0,0,0,,,7,1,0,0,BRURKA,0,2,0.5,0,0,,,,7,7,7,7,0,0,0,0,0
BLOMHR,1090,DESCRIPTION,c:\Program Files\MicroSurvey\STN013411\b01090.dwg,0,znacky_ostatne,0,0,0,0,0,0,,,7,1,0,0,BLOMHR,0,2,0.5,0,0,,,,7,7,7,7,0,0,0,0,0
STATH,2010,DESCRIPTION,,0,,0,0,0,0,0,0,STATH,L02010,7,1,1,0,STATH,0,2,0.5,0,0,,,,7,7,7,7,0,0,0,0,0
KRAJH,2030,DESCRIPTION,,0,,0,0,0,0,0,0,KRAJH,L02030,7,1,1,0,KRAJH,0,2,0.5,0,0,,,,7,7,7,7,0,0,0,0,0
OKREH,2040,DESCRIPTION,,0,,0,0,0,0,0,0,OKREH,L02040,7,1,1,0,OKREH,0,2,0.5,0,0,,,,7,7,7,7,0,0,0,0,0
OBECH,2050,DESCRIPTION,,0,,0,0,0,0,0,0,OBECH,L02050,7,1,1,0,OBECH,0,2,0.5,0,0,,,,7,7,7,7,0,0,0,0,0
KATAH,2060,DESCRIPTION,,0,,0,0,0,0,0,0,KATAH,L02060,7,1,1,0,KATAH,0,2,0.5,0,0,,,,7,7,7,7,0,0,0,0,0
INTRH,2070,DESCRIPTION,,0,,0,0,0,0,0,0,INTRH,L02070,7,1,1,0,INTRH,0,2,0.5,0,0,,,,7,7,7,7,0,0,0,0,0
PLDP,2103,DESCRIPTION,,0,,0,0,0,0,0,0,PLDP,L02100,7,1,1,0,PLDP,0,2,0.5,0,0,,,,7,7,7,7,0,0,0,0,0
PLDPM,2104,DESCRIPTION,,0,,0,0,0,0,0,0,PLDPM,L02101,7,1,1,0,PLDPM,0,2,0.5,0,0,,,,7,7,7,7,0,0,0,0,0
PLKP,2123,DESCRIPTION,,0,,0,0,0,0,0,0,PLKP,L02120,7,1,1,0,PLKP,0,2,0.5,0,0,,,,7,7,7,7,0,0,0,0,0
PLKPM,2124,DESCRIPTION,,0,,0,0,0,0,0,0,PLKPM,L02121,7,1,1,0,PLKPM,0,2,0.5,0,0,,,,7,7,7,7,0,0,0,0,0
PLZLM,2142,DESCRIPTION,,0,,0,0,0,0,0,0,PLZLM,L02141,7,1,1,0,PLZLM,0,2,0.5,0,0,,,,7,7,7,7,0,0,0,0,0
PLZP,2143,DESCRIPTION,,0,,0,0,0,0,0,0,PLZP,L02140,7,1,1,0,PLZP,0,2,0.5,0,0,,,,7,7,7,7,0,0,0,0,0
PLZPM,2144,DESCRIPTION,,0,,0,0,0,0,0,0,PLZPM,L02141,7,1,1,0,PLZPM,0,2,0.5,0,0,,,,7,7,7,7,0,0,0,0,0
PLZOM,2152,DESCRIPTION,,0,,0,0,0,0,0,0,PLZOM,L02151,7,1,1,0,PLZOM,0,2,0.5,0,0,,,,7,7,7,7,0,0,0,0,0
PLML,2161,DESCRIPTION,,0,,0,0,0,0,0,1,PLML,L02160,7,1,1,1,PLML,0,2,0.5,0,0,,,,7,7,7,7,0,0,0,0,0
PLMP,2162,DESCRIPTION,,0,,0,0,0,0,0,0,PLMP,L02160,7,1,1,0,PLMP,0,2,0.5,0,0,,,,7,7,7,7,0,0,0,0,0
PLMO,2170,DESCRIPTION,,0,,0,0,0,0,0,1,PLMO,L02170,7,1,1,1,PLMO,0,2,0.5,0,0,,,,7,7,7,7,0,0,0,0,0
ZLUCKA,2180,DESCRIPTION,c:\Program Files\MicroSurvey\STN013411\b02180.dwg,0,znacky_ostatne,0,0,0,0,0,0,,,7,1,0,0,ZLUCKA,0,2,0.5,0,0,,,,7,7,7,7,0,0,0,0,0
DPCHME,3020,DESCRIPTION,c:\Program Files\MicroSurvey\STN013411\c03020.dwg,0,znacky_zelen,0,0,0,0,0,0,,,7,1,0,0,DPCHME,0,2,0.5,0,0,,,,7,7,7,7,0,0,0,0,0
DPVINI,3030,DESCRIPTION,c:\Program Files\MicroSurvey\STN013411\c03030.dwg,0,znacky_zelen,0,0,0,0,0,0,,,7,1,0,0,DPVINI,0,2,0.5,0,0,,,,7,7,7,7,0,0,0,0,0
DPSAD,3050,DESCRIPTION,c:\Program Files\MicroSurvey\STN013411\c03050.dwg,0,znacky_zelen,0,0,0,0,0,0,,,7,1,0,0,DPSAD,0,2,0.5,0,0,,,,7,7,7,7,0,0,0,0,0
DPLUKA,3060,DESCRIPTION,c:\Program Files\MicroSurvey\STN013411\C03060.DWG,0,znacky_zelen,0,0,0,0,0,0,,,7,1,0,0,DPLUKA,0,2,0.5,0,0,,,,7,7,7,7,0,0,0,0,0
DPPAST,3070,DESCRIPTION,c:\Program Files\MicroSurvey\STN013411\c03070.dwg,0,znacky_zelen,0,0,0,0,0,0,,,7,1,0,0,DPPAST,0,2,0.5,0,0,,,,7,7,7,7,0,0,0,0,0
DPIHLI,3090,DESCRIPTION,c:\Program Files\MicroSurvey\STN013411\c03090.dwg,0,znacky_zelen,0,0,0,0,0,0,,,7,1,0,0,DPIHLI,0,2,0.5,0,0,,,,7,7,7,7,0,0,0,0,0
DPLIST,3100,DESCRIPTION,c:\Program Files\MicroSurvey\STN013411\c03100.dwg,0,znacky_zelen,0,0,0,0,0,0,,,7,1,0,0,DPLIST,0,2,0.5,0,0,,,,7,7,7,7,0,0,0,0,0
DPKOSO,3120,DESCRIPTION,c:\Program Files\MicroSurvey\STN013411\c03110.dwg,0,znacky_zelen,0,0,0,0,0,0,,,7,1,0,0,DPKOSO,0,2,0.5,0,0,,,,7,7,7,7,0,0,0,0,0
CINTOR,3150,DESCRIPTION,c:\Program Files\MicroSurvey\STN013411\c03150.dwg,0,znacky_ostatne,0,0,0,0,0,0,,,7,1,0,0,CINTOR,0,2,0.5,0,0,,,,7,7,7,7,0,0,0,0,0
DPNEPL,3160,DESCRIPTION,c:\Program Files\MicroSurvey\STN013411\c03160.dwg,0,znacky_ostatne,0,0,0,0,0,0,,,7,1,0,0,DPNEPL,0,2,0.5,0,0,,,,7,7,7,7,0,0,0,0,0
DPRAKO,3170,DESCRIPTION,c:\Program Files\MicroSurvey\STN013411\c03170.dwg,0,znacky_zelen,0,0,0,0,0,0,,,7,1,0,0,DPRAKO,0,2,0.5,0,0,,,,7,7,7,7,0,0,0,0,0
PAMIAT,3180,DESCRIPTION,c:\Program Files\MicroSurvey\STN013411\c03180.dwg,0,znacky_ostatne,0,0,0,0,0,0,,,7,1,0,0,PAMIAT,0,2,0.5,0,0,,,,7,7,7,7,0,0,0,0,0
STREC,4010,DESCRIPTION,,0,,0,0,0,0,0,0,STREC,L0401,7,1,1,0,STREC,0,2,0.5,0,0,,,,7,7,7,7,0,0,0,0,0
VYTAH,4050,DESCRIPTION,c:\Program Files\MicroSurvey\STN013411\c04050.dwg,0,znacky_ostatne,0,0,0,0,0,0,,,7,1,0,0,VYTAH,0,2,0.5,0,0,,,,7,7,7,7,0,0,0,0,0
DPDVOR,4060,DESCRIPTION,c:\Program Files\MicroSurvey\STN013411\c04060.dwg,0,znacky_ostatne,0,0,0,0,0,0,,,7,1,0,0,DPDVOR,0,2,0.5,0,0,,,,7,7,7,7,0,0,0,0,0
KOSTOL,4090,DESCRIPTION,c:\Program Files\MicroSurvey\STN013411\b04090.dwg,0,znacky_ostatne,0,0,0,0,0,0,,,7,1,0,0,KOSTOL,0,2,0.5,0,0,,,,7,7,7,7,0,0,0,0,0
SYNAGO,4100,DESCRIPTION,c:\Program Files\MicroSurvey\STN013411\c04100.dwg,0,znacky_ostatne,0,0,0,0,0,0,,,7,1,0,0,SYNAGO,0,2,0.5,0,0,,,,7,7,7,7,0,0,0,0,0
ZVONIC,4130,DESCRIPTION,c:\Program Files\MicroSurvey\STN013411\b04130.dwg,0,znacky_ostatne,0,0,0,0,0,0,,,7,1,0,0,ZVONIC,0,2,0.5,0,0,,,,7,7,7,7,0,0,0,0,0
VAHA,4150,DESCRIPTION,c:\Program Files\MicroSurvey\STN013411\b04150.dwg,0,znacky_ostatne,0,0,0,0,0,0,,,7,1,0,0,VAHA,0,2,0.5,0,0,,,,7,7,7,7,0,0,0,0,0
STPHM,4160,DESCRIPTION,c:\Program Files\MicroSurvey\STN013411\b04160.dwg,0,znacky_ostatne,0,0,0,0,0,0,,,7,1,0,0,STPHM,0,2,0.5,0,0,,,,7,7,7,7,0,0,0,0,0
VETMOT,4180,DESCRIPTION,c:\Program Files\MicroSurvey\STN013411\b04180.dwg,0,znacky_ostatne,0,0,0,0,0,0,,,7,1,0,0,VETMOT,0,2,0.5,0,0,,,,7,7,7,7,0,0,0,0,0
MOST,4201,DESCRIPTION,,0,,0,0,0,0,0,0,MOST,L04200,7,1,1,0,MOST,0,2,0.5,0,0,,,,7,7,7,7,0,0,0,0,0
MOSTL,4202,DESCRIPTION,,0,,0,0,0,0,0,0,MOSTL,L04201,7,1,1,0,MOSTL,0,2,0.5,0,0,,,,7,7,7,7,0,0,0,0,0
MOSTP,4203,DESCRIPTION,,0,,0,0,0,0,0,0,MOSTP,L04201,7,1,1,0,MOSTP,0,2,0.5,0,0,,,,7,7,7,7,0,0,0,0,0
ZELUSE,5070,DESCRIPTION,c:\Program Files\MicroSurvey\STN013411\b05070.dwg,0,kolaje_troleje,0,0,0,0,0,0,,,7,1,0,0,ZELUSE,0,2,0.5,0,0,,,,7,7,7,7,0,0,0,0,0
ZVYSTY,5090,DESCRIPTION,c:\Program Files\MicroSurvey\STN013411\b05090.dwg,0,kolaje_troleje,0,0,0,0,0,0,,,7,1,0,0,ZVYSTY,0,2,0.5,0,0,,,,7,7,7,7,0,0,0,0,0
ZVYKRI,5100,DESCRIPTION,c:\Program Files\MicroSurvey\STN013411\b05100.dwg,0,kolaje_troleje,0,0,0,0,0,0,,,7,1,0,0,ZVYKRI,0,2,0.5,0,0,,,,7,7,7,7,0,0,0,0,0
ZVYODB,5110,DESCRIPTION,c:\Program Files\MicroSurvey\STN013411\b05110.dwg,0,kolaje_troleje,0,0,0,0,0,0,,,7,1,0,0,ZVYODB,0,2,0.5,0,0,,,,7,7,7,7,0,0,0,0,0
ZVYKON,5120,DESCRIPTION,c:\Program Files\MicroSurvey\STN013411\b05120.dwg,0,kolaje_troleje,0,0,0,0,0,0,,,7,1,0,0,ZVYKON,0,2,0.5,0,0,,,,7,7,7,7,0,0,0,0,0
ZZARAZ,5130,DESCRIPTION,c:\Program Files\MicroSurvey\STN013411\b05130.dwg,0,kolaje_troleje,0,0,0,0,0,0,,,7,1,0,0,ZZARAZ,0,2,0.5,0,0,,,,7,7,7,7,0,0,0,0,0
ZMNAVE,5150,DESCRIPTION,c:\Program Files\MicroSurvey\STN013411\b05150.dwg,0,kolaje_troleje,0,0,0,0,0,0,,,7,1,0,0,ZMNAVE,0,2,0.5,0,0,,,,7,7,7,7,0,0,0,0,0
ZSNAVE,5160,DESCRIPTION,c:\Program Files\MicroSurvey\STN013411\b05160.dwg,0,kolaje_troleje,0,0,0,0,0,0,,,7,1,0,0,ZSNAVE,0,2,0.5,0,0,,,,7,7,7,7,0,0,0,0,0
LAVYS,5210,DESCRIPTION,,0,,0,0,0,0,0,0,LAVYS,L05210,7,1,1,0,LAVYS,0,2,0.5,0,0,,,,7,7,7,7,0,0,0,0,0
LAPOZ,5220,DESCRIPTION,,0,,0,0,0,0,0,0,LAPOZ,L05220,7,1,1,0,LAPOZ,0,2,0.5,0,0,,,,7,7,7,7,0,0,0,0,0
DOPRA,5230,DESCRIPTION,,0,,0,0,0,0,0,0,DOPRA,L05230,7,1,1,0,DOPRA,0,2,0.5,0,0,,,,7,7,7,7,0,0,0,0,0
DOZNOB,5271,DESCRIPTION,c:\Program Files\MicroSurvey\STN013411\b05270.dwg,0,znacky_ostatne,0,0,0,0,0,0,,,7,1,0,0,DOZNOB,0,2,0.5,0,0,,,,7,7,7,7,0,0,0,0,0
VYSMAJ,5280,DESCRIPTION,c:\Program Files\MicroSurvey\STN013411\b05280.dwg,0,znacky_ostatne,0,0,0,0,0,0,,,7,1,0,0,VYSMAJ,0,2,0.5,0,0,,,,7,7,7,7,0,0,0,0,0
ZVODP,5292,DESCRIPTION,,0,,0,0,0,0,0,0,ZVODP,L05290,7,1,1,0,ZVODP,0,2,0.5,0,0,,,,7,7,7,7,0,0,0,0,0
ZVOD2,5293,DESCRIPTION,,0,,0,0,0,0,0,0,ZVOD2,L05290,7,1,1,0,ZVOD2,0,2,0.5,0,0,,,,7,7,7,7,0,0,0,0,0
STLPRH,6020,DESCRIPTION,c:\Program Files\MicroSurvey\STN013411\b06020.dwg,0,znacky_ostatne,0,0,0,0,0,0,,,7,1,0,0,STLPRH,0,2,0.5,0,0,,,,7,7,7,7,0,0,0,0,0
KONZOL,6030,DESCRIPTION,c:\Program Files\MicroSurvey\STN013411\b06030.dwg,0,znacky_ostatne,0,0,0,0,0,0,,,7,1,0,0,KONZOL,0,2,0.5,0,0,,,,7,7,7,7,0,0,0,0,0
VYSIEL,6040,DESCRIPTION,c:\Program Files\MicroSurvey\STN013411\b06040.dwg,0,znacky_ostatne,0,0,0,0,0,0,,,7,1,0,0,VYSIEL,0,2,0.5,0,0,,,,7,7,7,7,0,0,0,0,0
VEPOD,6060,DESCRIPTION,,0,,0,0,0,0,0,0,VEPOD,L06061,7,1,1,0,VEPOD,0,2,0.5,0,0,,,,7,7,7,7,0,0,0,0,0
VENEO,6070,DESCRIPTION,,0,,0,0,0,0,0,0,VENEO,L06072,7,1,1,0,VENEO,0,2,0.5,0,0,,,,7,7,7,7,0,0,0,0,0
SAVZDU,6100,DESCRIPTION,c:\Program Files\MicroSurvey\STN013411\b06100.dwg,0,znacky_voda,0,0,0,0,0,0,,,7,1,0,0,SAVZDU,0,2,0.5,0,0,,,,7,7,7,7,0,0,0,0,0
VPBRN,6151,DESCRIPTION,,0,,0,0,0,0,0,0,VPBRN,,7,1,1,0,VPBRN,0,2,0.5,0,0,,,,7,7,7,7,0,0,0,0,0
VPPIN,6161,DESCRIPTION,,0,,0,0,0,0,0,0,VPPIN,,7,1,1,0,VPPIN,0,2,0.5,0,0,,,,7,7,7,7,0,0,0,0,0
VPPIP,6162,DESCRIPTION,,0,,0,0,0,0,0,0,VPPIP,,7,1,1,0,VPPIP,0,2,0.5,0,0,,,,7,7,7,7,0,0,0,0,0
VPPIX,6163,DESCRIPTION,,0,,0,0,0,0,0,0,VPPIX,,7,1,1,0,VPPIX,0,2,0.5,0,0,,,,7,7,7,7,0,0,0,0,0
VPUZN,6171,DESCRIPTION,,0,,0,0,0,0,0,0,VPUZN,,7,1,1,0,VPUZN,0,2,0.5,0,0,,,,7,7,7,7,0,0,0,0,0
VPUZP,6172,DESCRIPTION,,0,,0,0,0,0,0,0,VPUZP,,7,1,1,0,VPUZP,0,2,0.5,0,0,,,,7,7,7,7,0,0,0,0,0
VPUZX,6173,DESCRIPTION,,0,,0,0,0,0,0,0,VPUZX,,7,1,1,0,VPUZX,0,2,0.5,0,0,,,,7,7,7,7,0,0,0,0,0
VVYPU,6180,DESCRIPTION,c:\Program Files\MicroSurvey\STN013411\b06180.dwg,0,znacky_voda,0,0,0,0,0,0,,,7,1,0,0,VVYPU,0,2,0.5,0,0,,,,7,7,7,7,0,0,0,0,0
VHLLB,6190,DESCRIPTION,c:\Program Files\MicroSurvey\STN013411\b06190.dwg,0,znacky_voda,0,0,0,0,0,0,,,7,1,0,0,VHLLB,0,2,0.5,0,0,,,,7,7,7,7,0,0,0,0,0
SAVETR,6210,DESCRIPTION,c:\Program Files\MicroSurvey\STN013411\b06210.dwg,0,znacky_voda,0,0,0,0,0,0,,,7,1,0,0,SAVETR,0,2,0.5,0,0,,,,7,7,7,7,0,0,0,0,0
SAODDE,6220,DESCRIPTION,c:\Program Files\MicroSurvey\STN013411\b06220.dwg,0,znacky_voda,0,0,0,0,0,0,,,7,1,0,0,SAODDE,0,2,0.5,0,0,,,,7,7,7,7,0,0,0,0,0
KPBRN,6230,DESCRIPTION,,0,,0,0,0,0,0,0,KPBRN,,7,1,1,0,KPBRN,0,2,0.5,0,0,,,,7,7,7,7,0,0,0,0,0
KPJKN,6241,DESCRIPTION,,0,,0,0,0,0,0,0,KPJKN,,7,1,1,0,KPJKN,0,2,0.5,0,0,,,,7,7,7,7,0,0,0,0,0
KPJKP,6242,DESCRIPTION,,0,,0,0,0,0,0,0,KPJKP,,7,1,1,0,KPJKP,0,2,0.5,0,0,,,,7,7,7,7,0,0,0,0,0
KPJKX,6243,DESCRIPTION,,0,,0,0,0,0,0,0,KPJKX,,7,1,1,0,KPJKX,0,2,0.5,0,0,,,,7,7,7,7,0,0,0,0,0
KPODN,6251,DESCRIPTION,,0,,0,0,0,0,0,0,KPODN,,7,1,1,0,KPODN,0,2,0.5,0,0,,,,7,7,7,7,0,0,0,0,0
KPODP,6252,DESCRIPTION,,0,,0,0,0,0,0,0,KPODP,,7,1,1,0,KPODP,0,2,0.5,0,0,,,,7,7,7,7,0,0,0,0,0
KPODX,6253,DESCRIPTION,,0,,0,0,0,0,0,0,KPODX,,7,1,1,0,KPODX,0,2,0.5,0,0,,,,7,7,7,7,0,0,0,0,0
KPDAN,6261,DESCRIPTION,,0,,0,0,0,0,0,0,KPDAN,,7,1,1,0,KPDAN,0,2,0.5,0,0,,,,7,7,7,7,0,0,0,0,0
KPDAP,6262,DESCRIPTION,,0,,0,0,0,0,0,0,KPDAP,,7,1,1,0,KPDAP,0,2,0.5,0,0,,,,7,7,7,7,0,0,0,0,0
KPDAX,6263,DESCRIPTION,,0,,0,0,0,0,0,0,KPDAX,,7,1,1,0,KPDAX,0,2,0.5,0,0,,,,7,7,7,7,0,0,0,0,0
KPSPN,6271,DESCRIPTION,,0,,0,0,0,0,0,0,KPSPN,,7,1,1,0,KPSPN,0,2,0.5,0,0,,,,7,7,7,7,0,0,0,0,0
KPSPP,6272,DESCRIPTION,,0,,0,0,0,0,0,0,KPSPP,,7,1,1,0,KPSPP,0,2,0.5,0,0,,,,7,7,7,7,0,0,0,0,0
KPSPX,6273,DESCRIPTION,,0,,0,0,0,0,0,0,KPSPX,,7,1,1,0,KPSPX,0,2,0.5,0,0,,,,7,7,7,7,0,0,0,0,0
KPPRN,6281,DESCRIPTION,,0,,0,0,0,0,0,0,KPPRN,,7,1,1,0,KPPRN,0,2,0.5,0,0,,,,7,7,7,7,0,0,0,0,0
KPPRP,6282,DESCRIPTION,,0,,0,0,0,0,0,0,KPPRP,,7,1,1,0,KPPRP,0,2,0.5,0,0,,,,7,7,7,7,0,0,0,0,0
KPPRX,6283,DESCRIPTION,,0,,0,0,0,0,0,0,KPPRX,,7,1,1,0,KPPRX,0,2,0.5,0,0,,,,7,7,7,7,0,0,0,0,0
KPVYN,6291,DESCRIPTION,,0,,0,0,0,0,0,0,KPVYN,,7,1,1,0,KPVYN,0,2,0.5,0,0,,,,7,7,7,7,0,0,0,0,0
KPVYP,6292,DESCRIPTION,,0,,0,0,0,0,0,0,KPVYP,,7,1,1,0,KPVYP,0,2,0.5,0,0,,,,7,7,7,7,0,0,0,0,0
KPVYX,6293,DESCRIPTION,,0,,0,0,0,0,0,0,KPVYX,,7,1,1,0,KPVYX,0,2,0.5,0,0,,,,7,7,7,7,0,0,0,0,0
SPADIS,6310,DESCRIPTION,c:\Program Files\MicroSurvey\STN013411\b06310.dwg,0,znacky_kanalizac,0,0,0,0,0,0,,,7,1,0,0,SPADIS,0,2,0.5,0,0,,,,7,7,7,7,0,0,0,0,0
PPBRN,6321,DESCRIPTION,,0,,0,0,0,0,0,0,PPBRN,,7,1,1,0,PPBRN,0,2,0.5,0,0,,,,7,7,7,7,0,0,0,0,0
PPNTN,6331,DESCRIPTION,,0,,0,0,0,0,0,0,PPNTN,,7,1,1,0,PPNTN,0,2,0.5,0,0,,,,7,7,7,7,0,0,0,0,0
PPSTN,6341,DESCRIPTION,,0,,0,0,0,0,0,0,PPSTN,,7,1,1,0,PPSTN,0,2,0.5,0,0,,,,7,7,7,7,0,0,0,0,0
PPVTN,6351,DESCRIPTION,,0,,0,0,0,0,0,0,PPVTN,,7,1,1,0,PPVTN,0,2,0.5,0,0,,,,7,7,7,7,0,0,0,0,0
TEPLN,6361,DESCRIPTION,,0,,0,0,0,0,0,0,TEPLN,,7,1,1,0,TEPLN,0,2,0.5,0,0,,,,7,7,7,7,0,0,0,0,0
TEPLP,6362,DESCRIPTION,,0,,0,0,0,0,0,0,TEPLP,,7,1,1,0,TEPLP,0,2,0.5,0,0,,,,7,7,7,7,0,0,0,0,0
TEPLX,6363,DESCRIPTION,,0,,0,0,0,0,0,0,TEPLX,,7,1,1,0,TEPLX,0,2,0.5,0,0,,,,7,7,7,7,0,0,0,0,0
VZDUN,6371,DESCRIPTION,,0,,0,0,0,0,0,0,VZDUN,,7,1,1,0,VZDUN,0,2,0.5,0,0,,,,7,7,7,7,0,0,0,0,0
VZDUP,6372,DESCRIPTION,,0,,0,0,0,0,0,0,VZDUP,,7,1,1,0,VZDUP,0,2,0.5,0,0,,,,7,7,7,7,0,0,0,0,0
VZDUX,6373,DESCRIPTION,,0,,0,0,0,0,0,0,VZDUX,,7,1,1,0,VZDUX,0,2,0.5,0,0,,,,7,7,7,7,0,0,0,0,0
PPCUCH,6380,DESCRIPTION,c:\Program Files\MicroSurvey\STN013411\b06380.dwg,0,znacky_plyn,0,0,0,0,0,0,,,7,1,0,0,PPCUCH,0,2,0.5,0,0,,,,7,7,7,7,0,0,0,0,0
PPMENA,6390,DESCRIPTION,c:\Program Files\MicroSurvey\STN013411\b06390.dwg,0,znacky_plyn,0,0,0,0,0,0,,,7,1,0,0,PPMENA,0,2,0.5,0,0,,,,7,7,7,7,0,0,0,0,0
PPIZSP,6400,DESCRIPTION,c:\Program Files\MicroSurvey\STN013411\b06400.dwg,0,znacky_plyn,0,0,0,0,0,0,,,7,1,0,0,PPIZSP,0,2,0.5,0,0,,,,7,7,7,7,0,0,0,0,0
PPODVO,6410,DESCRIPTION,c:\Program Files\MicroSurvey\STN013411\b06410.dwg,0,znacky_plyn,0,0,0,0,0,0,,,7,1,0,0,PPODVO,0,2,0.5,0,0,,,,7,7,7,7,0,0,0,0,0
PPDIRE,6420,DESCRIPTION,c:\Program Files\MicroSurvey\STN013411\b06420.dwg,0,znacky_plyn,0,0,0,0,0,0,,,7,1,0,0,PPDIRE,0,2,0.5,0,0,,,,7,7,7,7,0,0,0,0,0
PPKOMP,6440,DESCRIPTION,c:\Program Files\MicroSurvey\STN013411\b06440.dwg,0,znacky_plyn,0,0,0,0,0,0,,,7,1,0,0,PPKOMP,0,2,0.5,0,0,,,,7,7,7,7,0,0,0,0,0
PPODTR,6450,DESCRIPTION,c:\Program Files\MicroSurvey\STN013411\b06450.dwg,0,znacky_plyn,0,0,0,0,0,0,,,7,1,0,0,PPODTR,0,2,0.5,0,0,,,,7,7,7,7,0,0,0,0,0
PPREDU,6460,DESCRIPTION,c:\Program Files\MicroSurvey\STN013411\b06460.dwg,0,znacky_plyn,0,0,0,0,0,0,,,7,1,0,0,PPREDU,0,2,0.5,0,0,,,,7,7,7,7,0,0,0,0,0
PPARSA,6470,DESCRIPTION,c:\Program Files\MicroSurvey\STN013411\b06470.dwg,0,znacky_plyn,0,0,0,0,0,0,,,7,1,0,0,PPARSA,0,2,0.5,0,0,,,,7,7,7,7,0,0,0,0,0
PPSUSA,6480,DESCRIPTION,c:\Program Files\MicroSurvey\STN013411\b06480.dwg,0,znacky_plyn,0,0,0,0,0,0,,,7,1,0,0,PPSUSA,0,2,0.5,0,0,,,,7,7,7,7,0,0,0,0,0
PPOCHJ,6490,DESCRIPTION,c:\Program Files\MicroSurvey\STN013411\b06490.dwg,0,znacky_plyn,0,0,0,0,0,0,,,7,1,0,0,PPOCHJ,0,2,0.5,0,0,,,,7,7,7,7,0,0,0,0,0
PPOCHO,6500,DESCRIPTION,c:\Program Files\MicroSurvey\STN013411\b06500.dwg,0,znacky_plyn,0,0,0,0,0,0,,,7,1,0,0,PPOCHO,0,2,0.5,0,0,,,,7,7,7,7,0,0,0,0,0
TPBRN,6511,DESCRIPTION,,0,,0,0,0,0,0,0,TPBRN,,7,1,1,0,TPBRN,0,2,0.5,0,0,,,,7,7,7,7,0,0,0,0,0
TPBRP,6512,DESCRIPTION,,0,,0,0,0,0,0,0,TPBRP,,7,1,1,0,TPBRP,0,2,0.5,0,0,,,,7,7,7,7,0,0,0,0,0
TPBRX,6513,DESCRIPTION,,0,,0,0,0,0,0,0,TPBRX,,7,1,1,0,TPBRX,0,2,0.5,0,0,,,,7,7,7,7,0,0,0,0,0
TPPRN,6521,DESCRIPTION,,0,,0,0,0,0,0,0,TPPRN,,7,1,1,0,TPPRN,0,2,0.5,0,0,,,,7,7,7,7,0,0,0,0,0
TPPRP,6522,DESCRIPTION,,0,,0,0,0,0,0,0,TPPRP,,7,1,1,0,TPPRP,0,2,0.5,0,0,,,,7,7,7,7,0,0,0,0,0
TPPRX,6523,DESCRIPTION,,0,,0,0,0,0,0,0,TPPRX,,7,1,1,0,TPPRX,0,2,0.5,0,0,,,,7,7,7,7,0,0,0,0,0
HPPRN,6531,DESCRIPTION,,0,,0,0,0,0,0,0,HPPRN,,7,1,1,0,HPPRN,0,2,0.5,0,0,,,,7,7,7,7,0,0,0,0,0
HPPRP,6532,DESCRIPTION,,0,,0,0,0,0,0,0,HPPRP,,7,1,1,0,HPPRP,0,2,0.5,0,0,,,,7,7,7,7,0,0,0,0,0
HPPRX,6533,DESCRIPTION,,0,,0,0,0,0,0,0,HPPRX,,7,1,1,0,HPPRX,0,2,0.5,0,0,,,,7,7,7,7,0,0,0,0,0
TPPAN,6541,DESCRIPTION,,0,,0,0,0,0,0,0,TPPAN,,7,1,1,0,TPPAN,0,2,0.5,0,0,,,,7,7,7,7,0,0,0,0,0
TPPAP,6542,DESCRIPTION,,0,,0,0,0,0,0,0,TPPAP,,7,1,1,0,TPPAP,0,2,0.5,0,0,,,,7,7,7,7,0,0,0,0,0
TPPAX,6543,DESCRIPTION,,0,,0,0,0,0,0,0,TPPAX,,7,1,1,0,TPPAX,0,2,0.5,0,0,,,,7,7,7,7,0,0,0,0,0
TPSEN,6551,DESCRIPTION,,0,,0,0,0,0,0,0,TPSEN,,7,1,1,0,TPSEN,0,2,0.5,0,0,,,,7,7,7,7,0,0,0,0,0
TPSEP,6552,DESCRIPTION,,0,,0,0,0,0,0,0,TPSEP,,7,1,1,0,TPSEP,0,2,0.5,0,0,,,,7,7,7,7,0,0,0,0,0
TPSEX,6553,DESCRIPTION,,0,,0,0,0,0,0,0,TPSEX,,7,1,1,0,TPSEX,0,2,0.5,0,0,,,,7,7,7,7,0,0,0,0,0
LASLOB,6571,DESCRIPTION,c:\Program Files\MicroSurvey\STN013411\b06570.dwg,0,znacky_elektrika,0,0,0,0,0,0,,,7,1,0,0,LASLOB,0,2,0.5,0,0,,,,7,7,7,7,0,0,0,0,0
LASLSO,6580,DESCRIPTION,c:\Program Files\MicroSurvey\STN013411\b06580.dwg,0,znacky_elektrika,0,0,0,0,0,0,,,7,1,0,0,LASLSO,0,2,0.5,0,0,,,,7,7,7,7,0,0,0,0,0
ZEMVEP,6631,DESCRIPTION,,0,,0,0,0,0,0,0,ZEMVEP,,7,1,1,0,ZEMVEP,0,2,0.5,0,0,,,,7,7,7,7,0,0,0,0,0
ZEMVEX,6632,DESCRIPTION,,0,,0,0,0,0,0,0,ZEMVEX,,7,1,1,0,ZEMVEX,0,2,0.5,0,0,,,,7,7,7,7,0,0,0,0,0
KABSPO,6640,DESCRIPTION,c:\Program Files\MicroSurvey\STN013411\b06640.dwg,0,znacky_elektrika,0,0,0,0,0,0,,,7,1,0,0,KABSPO,0,2,0.5,0,0,,,,7,7,7,7,0,0,0,0,0
ELEKTR,6650,DESCRIPTION,c:\Program Files\MicroSurvey\STN013411\b06650.dwg,0,znacky_elektrika,0,0,0,0,0,0,,,7,1,0,0,ELEKTR,0,2,0.5,0,0,,,,7,7,7,7,0,0,0,0,0
DBVEOS,6680,DESCRIPTION,c:\Program Files\MicroSurvey\STN013411\b06680.dwg,0,znacky_elektrika,0,0,0,0,0,0,,,7,1,0,0,DBVEOS,0,2,0.5,0,0,,,,7,7,7,7,0,0,0,0,0
ZBVEOS,6690,DESCRIPTION,c:\Program Files\MicroSurvey\STN013411\b06690.dwg,0,znacky_elektrika,0,0,0,0,0,0,,,7,1,0,0,ZBVEOS,0,2,0.5,0,0,,,,7,7,7,7,0,0,0,0,0
OVPON,6711,DESCRIPTION,,0,,0,0,0,0,0,0,OVPON,,7,1,1,0,OVPON,0,2,0.5,0,0,,,,7,7,7,7,0,0,0,0,0
OVPOP,6712,DESCRIPTION,,0,,0,0,0,0,0,0,OVPOP,,7,1,1,0,OVPOP,0,2,0.5,0,0,,,,7,7,7,7,0,0,0,0,0
OVPOX,6713,DESCRIPTION,,0,,0,0,0,0,0,0,OVPOX,,7,1,1,0,OVPOX,0,2,0.5,0,0,,,,7,7,7,7,0,0,0,0,0
OVHN,6721,DESCRIPTION,,0,,0,0,0,0,0,0,OVHN,,7,1,1,0,OVHN,0,2,0.5,0,0,,,,7,7,7,7,0,0,0,0,0
OVHP,6722,DESCRIPTION,,0,,0,0,0,0,0,0,OVHP,,7,1,1,0,OVHP,0,2,0.5,0,0,,,,7,7,7,7,0,0,0,0,0
OVHX,6723,DESCRIPTION,,0,,0,0,0,0,0,0,OVHX,,7,1,1,0,OVHX,0,2,0.5,0,0,,,,7,7,7,7,0,0,0,0,0
ANTVN,6731,DESCRIPTION,,0,,0,0,0,0,0,0,ANTVN,,7,1,1,0,ANTVN,0,2,0.5,0,0,,,,7,7,7,7,0,0,0,0,0
ANTVP,6732,DESCRIPTION,,0,,0,0,0,0,0,0,ANTVP,,7,1,1,0,ANTVP,0,2,0.5,0,0,,,,7,7,7,7,0,0,0,0,0
ANTVX,6733,DESCRIPTION,,0,,0,0,0,0,0,0,ANTVX,,7,1,1,0,ANTVX,0,2,0.5,0,0,,,,7,7,7,7,0,0,0,0,0
PPOSN,6741,DESCRIPTION,,0,,0,0,0,0,0,0,PPOSN,,7,1,1,0,PPOSN,0,2,0.5,0,0,,,,7,7,7,7,0,0,0,0,0
PPOSP,6742,DESCRIPTION,,0,,0,0,0,0,0,0,PPOSP,,7,1,1,0,PPOSP,0,2,0.5,0,0,,,,7,7,7,7,0,0,0,0,0
PPOSX,6743,DESCRIPTION,,0,,0,0,0,0,0,0,PPOSX,,7,1,1,0,PPOSX,0,2,0.5,0,0,,,,7,7,7,7,0,0,0,0,0
HLASPO,6760,DESCRIPTION,c:\Program Files\MicroSurvey\STN013411\b06760.dwg,0,znacky_telekomun,0,0,0,0,0,0,,,7,1,0,0,HLASPO,0,2,0.5,0,0,,,,7,7,7,7,0,0,0,0,0
HLPOOB,6761,DESCRIPTION,c:\Program Files\MicroSurvey\STN013411\b06760.dwg,0,znacky_telekomun,0,0,0,0,0,0,,,7,1,0,0,HLPOOB,0,2,0.5,0,0,,,,7,7,7,7,0,0,0,0,0
HLVBOB,6771,DESCRIPTION,c:\Program Files\MicroSurvey\STN013411\b06770.dwg,0,znacky_telekomun,0,0,0,0,0,0,,,7,1,0,0,HLVBOB,0,2,0.5,0,0,,,,7,7,7,7,0,0,0,0,0
HODIOB,6781,DESCRIPTION,c:\Program Files\MicroSurvey\STN013411\b06780.dwg,0,znacky_telekomun,0,0,0,0,0,0,,,7,1,0,0,HODIOB,0,2,0.5,0,0,,,,7,7,7,7,0,0,0,0,0
ROZHOB,6791,DESCRIPTION,c:\Program Files\MicroSurvey\STN013411\b06790.dwg,0,znacky_telekomun,0,0,0,0,0,0,,,7,1,0,0,ROZHOB,0,2,0.5,0,0,,,,7,7,7,7,0,0,0,0,0
PRODN,6801,DESCRIPTION,,0,,0,0,0,0,0,0,PRODN,,7,1,1,0,PRODN,0,2,0.5,0,0,,,,7,7,7,7,0,0,0,0,0
PRODP,6802,DESCRIPTION,,0,,0,0,0,0,0,0,PRODP,,7,1,1,0,PRODP,0,2,0.5,0,0,,,,7,7,7,7,0,0,0,0,0
PRODX,6803,DESCRIPTION,,0,,0,0,0,0,0,0,PRODX,,7,1,1,0,PRODX,0,2,0.5,0,0,,,,7,7,7,7,0,0,0,0,0
KAVDN,6811,DESCRIPTION,,0,,0,0,0,0,0,0,KAVDN,,7,1,1,0,KAVDN,0,2,0.5,0,0,,,,7,7,7,7,0,0,0,0,0
KAVDX,6813,DESCRIPTION,,0,,0,0,0,0,0,0,KAVDX,,7,1,1,0,KAVDX,0,2,0.5,0,0,,,,7,7,7,7,0,0,0,0,0
KOLEP,6821,DESCRIPTION,,0,,0,0,0,0,0,0,KOLEP,,7,1,1,0,KOLEP,0,2,0.5,0,0,,,,7,7,7,7,0,0,0,0,0
KOLEX,6822,DESCRIPTION,,0,,0,0,0,0,0,0,KOLEX,,7,1,1,0,KOLEX,0,2,0.5,0,0,,,,7,7,7,7,0,0,0,0,0
SAREDU,6830,DESCRIPTION,c:\Program Files\MicroSurvey\STN013411\b06830.dwg,0,znacky_telekomun,0,0,0,0,0,0,,,7,1,0,0,SAREDU,0,2,0.5,0,0,,,,7,7,7,7,0,0,0,0,0
POVTAZ,7010,DESCRIPTION,c:\Program Files\MicroSurvey\STN013411\c07010.dwg,0,znacky_ostatne,0,0,0,0,0,0,,,7,1,0,0,POVTAZ,0,2,0.5,0,0,,,,7,7,7,7,0,0,0,0,0
HLINIS,7020,DESCRIPTION,c:\Program Files\MicroSurvey\STN013411\c07020.dwg,0,znacky_ostatne,0,0,0,0,0,0,,,7,1,0,0,HLINIS,0,2,0.5,0,0,,,,7,7,7,7,0,0,0,0,0
RASELI,7030,DESCRIPTION,c:\Program Files\MicroSurvey\STN013411\c07030.dwg,0,znacky_ostatne,0,0,0,0,0,0,,,7,1,0,0,RASELI,0,2,0.5,0,0,,,,7,7,7,7,0,0,0,0,0
LOM,7040,DESCRIPTION,c:\Program Files\MicroSurvey\STN013411\c07040.dwg,0,znacky_ostatne,0,0,0,0,0,0,,,7,1,0,0,LOM,0,2,0.5,0,0,,,,7,7,7,7,0,0,0,0,0
JAMA,7050,DESCRIPTION,c:\Program Files\MicroSurvey\STN013411\c07050.dwg,0,znacky_ostatne,0,0,0,0,0,0,,,7,1,0,0,JAMA,0,2,0.5,0,0,,,,7,7,7,7,0,0,0,0,0
STOLA,7060,DESCRIPTION,c:\Program Files\MicroSurvey\STN013411\b07060.dwg,0,znacky_ostatne,0,0,0,0,0,0,,,7,1,0,0,STOLA,0,2,0.5,0,0,,,,7,7,7,7,0,0,0,0,0
PRIESA,7070,DESCRIPTION,c:\Program Files\MicroSurvey\STN013411\b07070.dwg ,0,znacky_ostatne,0,0,0,0,0,0,,,7,1,0,0,PRIESA,0,2,0.5,0,0,,,,7,7,7,7,0,0,0,0,0
PRAMEN,8010,DESCRIPTION,c:\Program Files\MicroSurvey\STN013411\b08010.dwg,0,znacky_ostatne,0,0,0,0,0,0,,,7,1,0,0,PRAMEN,0,2,0.5,0,0,,,,7,7,7,7,0,0,0,0,0
VTOKST,8020,DESCRIPTION,c:\Program Files\MicroSurvey\STN013411\c08020.dwg,0,znacky_ostatne,0,0,0,0,0,0,,,7,1,0,0,VTOKST,0,2,0.5,0,0,,,,7,7,7,7,0,0,0,0,0
VODNAD,8030,DESCRIPTION,c:\Program Files\MicroSurvey\STN013411\c08030.dwg,0,znacky_ostatne,0,0,0,0,0,0,,,7,1,0,0,VODNAD,0,2,0.5,0,0,,,,7,7,7,7,0,0,0,0,0
MOCIBR,8040,DESCRIPTION,c:\Program Files\MicroSurvey\STN013411\c08040.dwg,0,znacky_ostatne,0,0,0,0,0,0,,,7,1,0,0,MOCIBR,0,2,0.5,0,0,,,,7,7,7,7,0,0,0,0,0
MOCPRI,8050,DESCRIPTION,c:\Program Files\MicroSurvey\STN013411\c08050.dwg,0,znacky_ostatne,0,0,0,0,0,0,,,7,1,0,0,MOCPRI,0,2,0.5,0,0,,,,7,7,7,7,0,0,0,0,0
MOCNEP,8060,DESCRIPTION,c:\Program Files\MicroSurvey\STN013411\c08060.dwg,0,znacky_ostatne,0,0,0,0,0,0,,,7,1,0,0,MOCNEP,0,2,0.5,0,0,,,,7,7,7,7,0,0,0,0,0
VTOKOB,8070,DESCRIPTION,c:\Program Files\MicroSurvey\STN013411\c08070.dwg,0,znacky_ostatne,0,0,0,0,0,0,,,7,1,0,0,VTOKOB,0,2,0.5,0,0,,,,7,7,7,7,0,0,0,0,0
HRADZA,8080,DESCRIPTION,c:\Program Files\MicroSurvey\STN013411\b08080.dwg,0,znacky_ostatne,0,0,0,0,0,0,,,7,1,0,0,HRADZA,0,2,0.5,0,0,,,,7,7,7,7,0,0,0,0,0
VODOCE,8090,DESCRIPTION,c:\Program Files\MicroSurvey\STN013411\b08090.dwg,0,znacky_ostatne,0,0,0,0,0,0,,,7,1,0,0,VODOCE,0,2,0.5,0,0,,,,7,7,7,7,0,0,0,0,0
LIMNIG,8100,DESCRIPTION,c:\Program Files\MicroSurvey\STN013411\b08100.dwg,0,znacky_ostatne,0,0,0,0,0,0,,,7,1,0,0,LIMNIG,0,2,0.5,0,0,,,,7,7,7,7,0,0,0,0,0
STUZBE,8120,DESCRIPTION,c:\Program Files\MicroSurvey\STN013411\b08120.dwg,0,znacky_ostatne,0,0,0,0,0,0,,,7,1,0,0,STUZBE,0,2,0.5,0,0,,,,7,7,7,7,0,0,0,0,0
VODOJE,8130,DESCRIPTION,c:\Program Files\MicroSurvey\STN013411\c08130.dwg,0,znacky_ostatne,0,0,0,0,0,0,,,7,1,0,0,VODOJE,0,2,0.5,0,0,,,,7,7,7,7,0,0,0,0,0
PLASIG,8140,DESCRIPTION,c:\Program Files\MicroSurvey\STN013411\b08140.dwg,0,znacky_ostatne,0,0,0,0,0,0,,,7,1,0,0,PLASIG,0,2,0.5,0,0,,,,7,7,7,7,0,0,0,0,0
POSISV,8150,DESCRIPTION,c:\Program Files\MicroSurvey\STN013411\b08150.dwg,0,znacky_ostatne,0,0,0,0,0,0,,,7,1,0,0,POSISV,0,2,0.5,0,0,,,,7,7,7,7,0,0,0,0,0
PRISTA,8160,DESCRIPTION,c:\Program Files\MicroSurvey\STN013411\c08160.dwg,0,znacky_ostatne,0,0,0,0,0,0,,,7,1,0,0,PRISTA,0,2,0.5,0,0,,,,7,7,7,7,0,0,0,0,0
ODKNAD,8180,DESCRIPTION,c:\Program Files\MicroSurvey\STN013411\c08180.dwg,0,znacky_ostatne,0,0,0,0,0,0,,,7,1,0,0,ODKNAD,0,2,0.5,0,0,,,,7,7,7,7,0,0,0,0,0